{"text_format":"1","workbook":"xlsx","n_sheets":11,"sheets":["1","Data","Shapes","Temp","viz","viz2","Missing","Colors","vp","Dis","Ivls"],"not_rendered":{"charts":0,"images":0,"macros":1,"external_links":0,"defined_names":2,"comments":3,"pivot_tables":1},"unopened":[],"bounds":{"document_bytes":16777216,"sheet_cells":100000,"rows_first":2000,"rows_last":500,"rows_between":2000,"halvings":0,"cell_chars":16384,"cell_head_chars":4096},"cells_cut":0,"cells_raw":0,"read":"whole","date_system":"1900"}

{"sheet":"1","index":0,"n_rows":247,"n_cols":25,"rows_kept":247,"cut":false,"hidden":false,"merged":[[0,5,0,12],[91,5,91,6],[84,5,84,6],[83,5,83,6],[85,5,85,6],[86,5,86,6],[89,5,89,6],[88,5,88,6],[87,5,87,6],[90,5,90,6],[26,0,138,0],[21,1,25,1],[1,0,25,0],[176,1,181,1],[182,1,188,1],[139,0,225,0],[83,1,91,1],[192,1,204,1],[205,1,219,1],[189,1,191,1],[1,1,20,1],[220,1,225,1],[156,1,175,1],[141,1,155,1],[27,1,36,1],[37,1,44,1],[45,1,63,1],[64,1,82,1],[128,1,138,1],[139,1,140,1],[117,1,127,1],[92,1,109,1],[110,1,116,1]]}
["CL","Group","Rule","Spec","Voice","Subrules",null,null,null,null,null,null,null,"Paragraph",null,"Comment",null,"IDs"]
["Rhythm","Rhythm","Beginning is non-standard",null,null,"1/8 note",null,null,null,null,null,null,null,18,null,null,null,230]
[null,null,"Misuse of rest",null,null,"rest inside",null,null,null,null,null,null,null,18,null,null,null,517]
[null,null,"Misuse of rest",null,null,"wrong starting rest","late entrance",null,null,null,null,null,null,18,null,"This rule is ignored if there is no cantus firmus",null,138,527]
[null,null,"Missing rest",null,null,"/no starting rest",null,null,null,null,null,null,null,18,null,"This rule is ignored if there is no cantus firmus",null,237]
[null,null,"Simultaneous entries of voices",null,null,"/simultaneous",null,null,null,null,null,null,null,18,null,"This rule is ignored if there is no cantus firmus",null,530]
[null,null,"Same rhythm in adjacent measures",null,null,"/same",null,null,null,null,null,null,null,23,null,null,null,247]
[null,null,"Identical rhythm in two parts",null,null,"/same",null,null,null,null,null,null,null,23,null,null,null,549]
[null,null,"Identical rhythm in all parts",null,null,"/same",null,null,null,null,null,null,null,23,null,"For any species except species 1",null,215]
[null,null,"Non-permitted rhythm",5,null,"1/2. downbeat","1/2. upbeat","1/4 syncope",null,null,null,null,null,21,null,"For species 5",null,233,234,235]
[null,null,"Non-permitted rhythm",null,null,"rhythm stagnation","long inside","full-measure note inside",null,null,null,null,null,17,null,null,null,236,160,266]
[null,null,"Wrong usage of eighth notes",5,null,"1st beat","2nd beat","3rd beat","4th beat","isolated","1/8 syncope",">2 x 1/8","leap",21,null,null,null,226,227,228,229,231,232,255,88]
[null,null,"Anapaest",5,null,"tie forward","inside",null,null,null,null,null,null,21,null,"1/2 after 1/4 or 1/8 in measure",null,239,240]
[null,null,"Wrong note value for this species",null,null,"/value",null,null,null,null,null,null,null,17,null,"Please see link to table with allowed note values near this mistake",null,514]
[null,null,"Wrong time signature for this species",null,null,"/measure len",null,null,null,null,null,null,null,17,null,null,null,525]
[null,null,"Wrong positioning of note for this species",12340,null,"/position",null,null,null,null,null,null,null,17,null,"Please see link to table with allowed positionings of notes near this mistake",null,515]
[null,null,"Note lasts for too many measures",null,null,">2",null,null,null,null,null,null,null,17,null,null,null,41]
[null,null,"The length of last note is not full measure",1230,null,"/not full measure",null,null,null,null,null,null,null,19,null,null,null,306]
[null,null,"Wrong suspension rhythm",null,null,"sus wrong length","prep < sus","prep wrong length",null,null,null,null,null,63,null,"Suspension preparation and suspension",null,244,427,274]
[null,null,"Need more suspensions",null,null,"each 3 meas.",null,null,null,null,null,null,null,null,null,null,null,341]
[null,null,"Too many notes in one measure",5,null,"5 notes after sus.","5 notes without sus.",">5 notes",null,null,null,null,null,21,null,null,null,301,245,246]
[null,"Repeats and ties","Note repeat",null,null,"cantus",":inside measure",null,null,null,null,null,null,21,null,null,null,30,516]
[null,null,"Notes repeat in all parts",1,null,"/multivoice",null,null,null,null,null,null,null,31,null,null,null,557]
[null,null,"Note is repeated: in 10 notes",10,null,"once","2 times",">2 times",null,null,null,null,null,31,null,"Note repeat happens several times",null,93,94,95]
[null,null,"Note repeat",2345,null,"/any",null,null,null,null,null,null,null,31,null,"Note is repeated",null,261]
[null,null,"Frequent interruption of syncopation: within 10 notes",4,null,"once","2 times",">2 times",null,null,null,null,null,17,null,"Except interruption of syncopation between penultimate and last measure",null,188,189,190]
["Melody","Border","Leading tone is unresolved",12345,null,"/unresolved",null,null,null,null,null,null,null,6,null,null,null,197]
[null,"Compensated leap","8ve compensated only to 4th",null,null,"8ve",null,null,null,null,null,null,null,25,null,null,null,304]
[null,null,"Uncompensated leap: compensation deviation to 2nd",12340,null,"3rd","4th","5th","6th","8ve","late >3",">5th long",null,25,null,"Compensation can be deviated one 2nd interval above last leap note",null,100,101,102,103,104,191,386]
[null,null,"Uncompensated leap: compensation deviation to 2nd",5,null,"3rd","4th","5th","6th","8ve","late >3",">5th long",null,25,null,"Compensation can be deviated one 2nd interval above last leap note",null,100,101,102,103,104,191,386]
{"$rows_left_out":218}
{"sheet":"Data","index":1,"n_rows":465,"n_cols":26,"rows_kept":465,"cut":false,"hidden":false,"merged":[]}
["Rid","Class","Group","Rule","Subrule","VIZ","VI","VC","VH","VS","VT","FQ","CF","GFP","IFP","DEU","MEI","ER","UE","R","Severity","Flag","Spec","Voice","GComment","Comment"]
[1,"Melody","Uncompensated leap","Uncompensated leap","border 4th",null,null,null,null,null,null,null,null,null,null,null,null,null,null,null,0,-1,5,null,"If no other uncompensated rules worked.","Border leap of this size or below"]
[2,"Melody","Tritone","Tritone: adjacent",":resolved",null,null,null,null,null,null,null,null,null,null,null,null,null,null,null,50,0,10,null,"Melodic adjacent tritone","Search 4 quarters for resolution if penultimate measure"]
[3,"Harmony","Nonchord tones","Double-neighbor tone","approached by leap",null,null,null,null,null,null,null,null,null,null,null,null,null,null,null,0,0,null,null,null,"There is a leap before first note of double-neighbour tone group"]
[8,"Melody","Change of melodic direction around leap","Leap back","<=6th",null,null,null,null,null,null,null,null,null,null,null,null,null,null,null,0,-1,null,null,null,"After leap there is an immediate returning leap in the opposite direction. This returning leap is a 6th or shorter"]
[10,"Melody","Melodic repeats","Frequent return to the same note",">3 in 7 notes",null,null,null,null,null,null,null,null,null,null,null,null,null,null,null,0,-1,null,null,"Same note repeats more than AA times within BB adjacent notes"]
[12,"Melody","Melodic repeats","Melodic climax is repeated","in upper part",null,null,null,null,null,null,null,null,null,null,null,null,null,null,null,100,0,12345,null,null,"Multiple culminations in higher voice"]
[15,"Melody","Range","No melody development","12 notes <12",null,null,null,null,null,null,null,null,null,null,null,null,null,null,null,0,1,null,null,null,"Averaged melody direction within AA notes is less than BB deci-semitones"]
[16,"Melody","Range","No melody development","15 notes <15",null,null,null,null,null,null,null,null,null,null,null,null,null,null,null,0,1,null,null,null,"Averaged melody direction within AA notes is less than BB deci-semitones"]
[17,"Harmony","Harmony","Repeating functions in a row",">4 T",null,null,null,null,null,null,null,null,null,null,null,null,null,null,null,0,0,null,null,"More than AA consecutive harmonies all have this letter"]
[18,"Melody","Tritone","Audible tritone: framed",":resolved",null,null,null,null,null,null,null,null,null,null,null,null,null,null,null,0,0,2345,null,"Tritone within measure with intermediate notes, framed by two melody direction changes"]
[19,"Melody","Tritone","Audible tritone: framed",":unresolved",null,null,null,null,null,null,null,null,null,null,null,null,null,null,null,50,0,2345,null,"Tritone within measure with intermediate notes, framed by two melody direction changes"]
[20,"Harmony","Harmony","Missing functions in a row",">5 without T",null,null,null,null,null,null,null,null,null,null,null,null,null,null,null,0,0,null,null,"More than AA consecutive harmonies do not have this letter"]
[21,"Melody","Melodic repeats","Melodic climax","late 3",null,null,null,null,null,null,null,null,null,null,null,null,null,null,null,0,-1,null,null,null,"Only for upper voice"]
[22,"Melody","Change of melodic direction around leap","Leap back",">6th",null,null,null,null,null,null,null,null,null,null,null,null,null,null,null,0,-1,null,null,null,"After leap there is an immediate returning leap in the opposite direction. This returning leap is longer than 6th"]
[23,"Harmony","Harmony","Harmonic progression","3 x bad",null,null,null,null,null,null,null,null,null,null,null,null,null,null,null,0,0,null,null,null,"Three consecutive harmonic progressions each with penalty 2"]
[24,"Harmony","Voice motion","Voice overlapping","adjacent voices",null,null,null,null,null,null,null,null,null,null,null,null,null,null,null,0,0,null,">4"]
[29,"Harmony","Voice motion","Voice overlapping","adjacent (touch)",null,null,null,null,null,null,null,null,null,null,null,null,null,null,null,0,0,null,">4"]
[30,"Rhythm","Repeats and ties","Note repeat","cantus",null,null,null,null,null,null,null,null,null,null,null,null,null,null,null,100,0,null,null,null,"Slurs are prohibited in cantus"]
[31,"Melody","Tritone","Tritone: adjacent",":unresolved",null,null,null,null,null,null,null,null,null,null,null,null,null,null,null,100,0,10,null,"Melodic adjacent tritone"]
[36,"Harmony","Dissonance","Non-chord tone approached by leap","/leap",null,null,null,null,null,null,null,null,null,null,null,null,null,null,null,100,0,null,null,null,"Leap to harmonic upbeat dissonance"]
[39,"Melody","Melodic repeats","Frequent return to the same note",">4 in 9 notes",null,null,null,null,null,null,null,null,null,null,null,null,null,null,null,50,0,null,null,"Same note repeats more than AA times within BB adjacent notes"]
[41,"Rhythm","Rhythm","Note lasts for too many measures",">2",null,null,null,null,null,null,null,null,null,null,null,null,null,null,null,50,0,null,null,null,"Note crosses more than two measures"]
[47,"Harmony","Border","Penultimate chord",":no leading-tone",null,null,null,null,null,null,null,null,null,null,null,null,null,null,null,50,0,12345,null,null,"no leading tone is allowed if last bass notes are V-I"]
[48,"Harmony","Harmony","Cadential progression","V-I",null,null,null,null,null,null,null,null,null,null,null,null,null,null,null,50,0,null,null,null,"Bass note going from V note to I octave in outer voices in D-T progression before cadence"]
[57,"Harmony","Harmony","Harmonic progression","bad",null,null,null,null,null,null,null,null,null,null,null,null,null,null,null,0,-1,null,null,null,"See harmonic progressions with penalty 2"]
[58,"Melody","Change of melodic direction around leap","Leap back","overflow",null,null,null,null,null,null,null,null,null,null,null,null,null,null,null,0,-1,null,null,null,"After leap there is an immediate returning leap in the opposite direction. This returning leap is longer than initial leap"]
[67,"Melody","Range","Skipped notes",1,null,null,null,null,null,null,null,null,null,null,null,null,null,null,null,0,-1,null,null,"Skipped notes that do not appear within this voice"]
[68,"Melody","Range","Skipped notes",">1",null,null,null,null,null,null,null,null,null,null,null,null,null,null,null,0,-1,null,null,"Skipped notes that do not appear within this voice"]
[69,"Melody","Range","Skipped notes",">1 joined",null,null,null,null,null,null,null,null,null,null,null,null,null,null,null,0,0,null,null,"Skipped notes that do not appear within this voice"]
{"$rows_left_out":436}
{"sheet":"Shapes","index":2,"n_rows":21,"n_cols":3,"rows_kept":21,"cut":false,"hidden":false,"merged":[]}
[null,"Text","ABCjs alternative"]
["0. Just flag number","yes"]
["1. Harmony","no"]
["2. Interval","no"]
["3. Vertical brackets","no","no color"]
["4. Volta repeat","yes"]
["5. Slurs","no","no color"]
["6. Phrasing slurs","no"]
["7. Glissando","yes (if neighboring notes)"]
["8. Analysis brackets","yes"]
["9. Trills","yes","issue created"]
["10. TextSpanner","yes"]
["11. Ottava bracket","yes"]
["12. Pedal bracket","yes"]
["13. Note name","no"]
["14. Staccato"]
["15. Staccattissimo"]
["16. Note color","no"]
["17. Petrucci notehead"]
["18. Cross on a stem"]
["19. Circle around notehead","no","muted note (x)"]

{"sheet":"Temp","index":3,"n_rows":16,"n_cols":23,"rows_kept":16,"cut":false,"hidden":false,"merged":[]}
["Rid","Class","Group","Rule","Subrule","VIZ","VI","V2","VT","FQ","CF","GFP","IFP","DEU","MEI","ER","UE","R","Severity","Flag","GComment","Comment","Set"]
[3,"Melody","Leaps","Many leaps within 9 notes",">8 leaps","10",null,null,"!srn!",{"$f":"VLOOKUP($A2,#REF!, 2,0)","v":{"$error":"#REF!"}},{"$f":"VLOOKUP($A2,#REF!, 3,0)","v":{"$error":"#REF!"}},null,null,null,1,"311",null,null,60,0,null,null,1]
[25,"Melody","Leaps","Many leaps within 9 notes",">30 notes","10",null,null,"Many leaps",{"$f":"VLOOKUP($A3,#REF!, 2,0)","v":{"$error":"#REF!"}},{"$f":"VLOOKUP($A3,#REF!, 3,0)","v":{"$error":"#REF!"}},null,null,null,1,"312",null,null,60,0,null,"Total leaps length more than X notes:  3 is third, 4 is fourth and so on",1]
[202,"Melody","Leaps","Many leaps within 15 notes",">12 leaps","10",null,null,"!srn!",{"$f":"VLOOKUP($A4,#REF!, 2,0)","v":{"$error":"#REF!"}},{"$f":"VLOOKUP($A4,#REF!, 3,0)","v":{"$error":"#REF!"}},null,null,null,1,"313",null,null,60,0,null,null,1]
[273,"Melody","Leaps","Many leaps within 15 notes",">42 notes","10",null,null,"Many leaps",{"$f":"VLOOKUP($A5,#REF!, 2,0)","v":{"$error":"#REF!"}},{"$f":"VLOOKUP($A5,#REF!, 3,0)","v":{"$error":"#REF!"}},null,null,null,1,"314",null,null,60,0,null,"Total leaps length more than X notes:  3 is third, 4 is fourth and so on",1]
[302,"Melody","Stepwise","Stepwise motion",">14 any direction",10,null,null,"Long stepwise",{"$f":"VLOOKUP($A6,#REF!, 2,0)","v":{"$error":"#REF!"}},{"$f":"VLOOKUP($A6,#REF!, 3,0)","v":{"$error":"#REF!"}},null,null,null,null,null,null,null,60,0,"There are more than X notes going stepwize in the same direction in this counterpoint","Stepwise motion more than X notes in any direction",1]
[303,"Melody","Stepwise","Stepwise motion",">7 one direction",10,null,null,"Long stepwise",{"$f":"VLOOKUP($A7,#REF!, 2,0)","v":{"$error":"#REF!"}},{"$f":"VLOOKUP($A7,#REF!, 3,0)","v":{"$error":"#REF!"}},null,null,null,null,null,null,null,60,0,"There are more than X notes going stepwize in the same direction in this counterpoint","Stepwise motion more than X notes in one direction",1]
[311,"Melody","Leaps","Many leaps within 9 notes",">5 leaps","10",null,null,"!srn!",{"$f":"VLOOKUP($A8,#REF!, 2,0)","v":{"$error":"#REF!"}},{"$f":"VLOOKUP($A8,#REF!, 3,0)","v":{"$error":"#REF!"}},null,1,null,1,null,null,null,0,0,null,null,1]
[312,"Melody","Leaps","Many leaps within 9 notes",">18 notes","10",null,null,"Many leaps",{"$f":"VLOOKUP($A9,#REF!, 2,0)","v":{"$error":"#REF!"}},{"$f":"VLOOKUP($A9,#REF!, 3,0)","v":{"$error":"#REF!"}},null,1,null,1,null,null,null,0,0,null,"Total leaps length more than X notes:  3 is third, 4 is fourth and so on",1]
[313,"Melody","Leaps","Many leaps within 15 notes",">7 leaps","10",null,null,"!srn!",{"$f":"VLOOKUP($A10,#REF!, 2,0)","v":{"$error":"#REF!"}},{"$f":"VLOOKUP($A10,#REF!, 3,0)","v":{"$error":"#REF!"}},null,1,null,1,null,null,null,0,0,null,null,1]
[314,"Melody","Leaps","Many leaps within 15 notes",">26 notes","10",null,null,"Many leaps",{"$f":"VLOOKUP($A11,#REF!, 2,0)","v":{"$error":"#REF!"}},{"$f":"VLOOKUP($A11,#REF!, 3,0)","v":{"$error":"#REF!"}},null,1,null,1,null,null,null,0,0,null,"Total leaps length more than X notes:  3 is third, 4 is fourth and so on",1]
[6,"Melody","Leaps","Consecutive unidirectional 3rds","without 6/8","10",null,null,"2 x 3rds",{"$f":"VLOOKUP($A12,#REF!, 2,0)","v":{"$error":"#REF!"}},{"$f":"VLOOKUP($A12,#REF!, 3,0)","v":{"$error":"#REF!"}},1,null,null,null,null,null,null,60,0,"There are two immediately adjacent 3rd leaps going in the same direction","There is no 6th or 8va leap before in an opposite direction",1]
[27,"Melody","Leaps","Consecutive unidirectional leaps","Sum >5th","10",null,null,"Leaps",{"$f":"VLOOKUP($A13,#REF!, 2,0)","v":{"$error":"#REF!"}},{"$f":"VLOOKUP($A13,#REF!, 3,0)","v":{"$error":"#REF!"}},null,null,null,null,null,null,null,100,0,"There are two immediately adjacent leaps going in the same direction",null,1]
[28,"Melody","Leaps","Consecutive unidirectional 3rds","after 6/8","10",null,null,"2 x 3rds",{"$f":"VLOOKUP($A14,#REF!, 2,0)","v":{"$error":"#REF!"}},{"$f":"VLOOKUP($A14,#REF!, 3,0)","v":{"$error":"#REF!"}},1,null,null,null,null,null,null,0,-1,"There are two immediately adjacent 3rd leaps going in the same direction","After 6th or 8va leap in an opposite direction",1]
[70,"Melody","Leaps","Consecutive leaps: 1x3rd ignored","3","10",null,null,"Consecutive leaps",{"$f":"VLOOKUP($A15,#REF!, 2,0)","v":{"$error":"#REF!"}},{"$f":"VLOOKUP($A15,#REF!, 3,0)","v":{"$error":"#REF!"}},null,null,null,1,null,null,null,60,0,"There are more than X leaps. Several Y specified 3rd leaps are allowed and not counted. Not idiomatic for voice.",null,1]
[71,"Melody","Leaps","Consecutive leaps: 1x3rd ignored",">3","10",null,null,"Consecutive leaps",{"$f":"VLOOKUP($A16,#REF!, 2,0)","v":{"$error":"#REF!"}},{"$f":"VLOOKUP($A16,#REF!, 3,0)","v":{"$error":"#REF!"}},null,null,null,1,"70",null,null,100,0,"There are more than X leaps. Several Y specified 3rd leaps are allowed and not counted. Not idiomatic for voice.",null,1]

{"sheet":"viz","index":4,"n_rows":59,"n_cols":4,"rows_kept":59,"cut":false,"hidden":false,"merged":[]}
["Rule group","Shape","Text in staff","Shegolev"]
["Compensated leap","Slur","-"]
["Uncompensated leap","Slur","-"]
["Leap melody direction change","Slur","-"]
["Leap back","Slur","-"]
["Leap size","Slur","-"]
["Many leaps","Text spanner","Many leaps","Bracket"]
["2 consecutive 3rds","Text spanner","2 x 3rds","Bracket"]
["Long stepwize motion","Text spanner","Long stepwise","Bracket"]
["Multiple culminations","-","-"]
["Repeats","Vertical bracket","Repeat"]
["Many tonic notes / chords","Trill","Many tonics"]
["Stagnation, constrained local range, no development","Trill","Stagnation"]
["Letter repeat/miss","Trill","Repeat/miss"]
["Melodic tritone","Interval text","tri"]
["Skipped notes","-","-"]
["Voice range","-","-"]
["Total range","-","-"]
["Interval between voices","Pedal bracket","int >16th"]
["Harmonic mistakes","Harmony text","-"]
["First/last intervals","Interval text","-"]
["Unaltered VII before Im","Bracket","VII before Im","Text spanner"]
["Unaltered VII 10 after VII#","Bracket","VII after VII#","Text spanner"]
["VII near VI#","Bracket","VII near VI#","Text spanner"]
["VI# without VII#","-","-"]
["Leap to VI#","Slur","-"]
["Altered neighbor","Bracket","VI# (or VII#)","Text spanner"]
["Altered far neighbor","Bracket","VI# (or VII#)","Text spanner"]
["False cross relation","-","-"]
["Altered harmonic interval","Interval text","-"]
{"$rows_left_out":30}
{"sheet":"viz2","index":5,"n_rows":17,"n_cols":2,"rows_kept":17,"cut":false,"hidden":false,"merged":[]}
[]
[]
["Названия строк","Количество по полю Rule group"]
["-",13]
["Ottava bracket",7]
["Slur",7]
["Interval text",6]
["Bracket",6]
["Pedal bracket",4]
["Trill",3]
["Glis",3]
["Text spanner",3]
["Vertical bracket",2]
["Bracket + interval text",1]
["Volta",1]
["Harmony text",1]
["Общий итог",57]

{"sheet":"Missing","index":6,"n_rows":97,"n_cols":1,"rows_kept":97,"cut":false,"hidden":false,"merged":[]}
["Rid"]
[4]
[5]
[6]
[7]
[9]
[11]
[13]
[14]
[25]
[26]
[27]
[28]
[32]
[33]
[34]
[35]
[37]
[38]
[40]
[42]
[43]
[44]
[45]
[46]
[49]
[50]
[51]
[52]
[53]
{"$rows_left_out":68}
{"sheet":"Colors","index":7,"n_rows":0,"n_cols":0,"rows_kept":0,"cut":false,"hidden":false,"merged":[]}

{"sheet":"vp","index":8,"n_rows":11,"n_cols":3,"rows_kept":11,"cut":false,"hidden":false,"merged":[]}
["E","B","N"]
["H+B","nH+B","nB"]
["Extreme","With bass","Non-bass"]
[1,1,1]
[2,2,2]
[3,3,3]
[4,4,4]
[5,5,5]
[6,6,6]
[7,7,7]
[8,8,8]

{"sheet":"Dis","index":9,"n_rows":12,"n_cols":13,"rows_kept":12,"cut":false,"hidden":false,"merged":[[0,5,0,8],[0,1,0,4],[0,9,0,12]]}
["Диссонансы за исключениям задержаний и PDD","Секунда / септима / нона",null,null,null,"Кварта / тритон с басом",null,null,null,"Кварта / тритон без баса"]
[null,"Сильн","Прям","Прот","Косв","Сильн","Прям","Прот","Косв","Сильн","Прям","Прот","Косв"]
["Между двумя аккордовыми звуками, вступление скачками"]
["Между двумя аккордовыми звуками, вступление скачком"]
["Между двумя аккордовыми звуками, вступление поступенно"]
["Между аккордовым и неаккордовым звуками, вступление скачками"]
["Между аккордовым и неаккордовым звуками, вступление скачком к аккордовому"]
["Между аккордовым и неаккордовым звуками, вступление скачком к неаккордовому"]
["Между аккордовым и неаккордовым звуками, вступление поступенно"]
["Между двумя неаккордовыми звуками, вступление скачками"]
["Между двумя неаккордовыми звуками, вступление скачком"]
["Между двумя неаккордовыми звуками, вступление поступенно"]

{"sheet":"Ivls","index":10,"n_rows":13,"n_cols":12,"rows_kept":13,"cut":false,"hidden":false,"merged":[[1,3,1,11],[1,0,1,2],[2,0,3,2]]}
["LN1","LN2","LN3",9,11,0,2,4,5,6,7,8]
["Lower note",null,null,"Upper melodic minor note"]
[null,null,null,"I","II","III","IV","V","VI","VI#","VII","VII#"]
[null,null,null,"A","B","C","D","E","F","F#","G","G#"]
[9,"I","A","1|8","M2|M9","m3","4","5","m6","M6","m7","M7"]
[11,"II","B","m7","1|8","m2|m9","m3","4","dim5","5","m6","M6"]
[0,"III","C","M6","M7","1|8","M2|M9","m3","4","aug4","5","aug5"]
[2,"IV","D","5","M6","m7","1|8","M2|M9","m3","M3","4","aug4"]
[4,"V","E","4","5","m6","m7","1|8","m2|m9","M2|M9","m3","M3"]
[5,"VI","F","M3","aug4","5","M6","M7","1|8","aug1|aug8","M2|M9","aug2|aug9"]
[6,"VI#","F#","m3","4","dim5","m6","m7","M7","1|8","m2|m9","M2|M9"]
[7,"VII","G","M2|M9","M3","4","5","M6","m7","M7","1|8","aug1|aug8"]
[8,"VII#","G#","m2|m9","m3","dim4","dim5","m6","dim7","m7","dim8","1|8"]